{"text_format":"3","workbook":"xlsx","n_sheets":4,"sheets":["Семиборье (2000-2001)","Семиборье (1998-1999)","Семиборье (1998-1999) РТ","Семиборье (1995-1997)"],"not_rendered":{"external_links":1,"defined_names":5},"read":"whole","date_system":"1900"}

{"sheet":"Семиборье (2000-2001)","index":0,"n_rows":70,"n_cols":32,"rows_kept":70,"hidden":true,"merged":[[0,0,0,31],[1,0,1,31],[3,0,3,29],[7,31,8,31],[9,31,10,31],[11,31,12,31],[13,31,14,31],[15,31,16,31],[17,31,18,31],[19,31,20,31],[21,31,22,31],[23,31,24,31],[25,31,26,31],[27,31,28,31],[29,31,30,31],[31,31,32,31],[33,31,34,31],[35,31,36,31],[37,31,38,31],[39,31,40,31],[41,31,42,31],[43,31,44,31],[45,31,46,31],[47,31,48,31],[49,31,50,31],[51,31,52,31],[53,31,54,31],[55,31,56,31],[62,31,63,31],[64,31,65,31],[66,31,67,31],[68,31,69,31]]}
[{"$f":"#REF!","v":{"$error":"#REF!"}}]
[{"$f":"#REF!","v":{"$error":"#REF!"}}]
[]
[{"$f":"#REF!","v":{"$error":"#REF!"}}]
[]
[null,{"$f":"#REF!","v":{"$error":"#REF!"}},null," ",{"$nulls":25},{"$f":"#REF!","v":{"$error":"#REF!"}}]
["Место","Фамилия Имя","Д.р.","Команда,\nорганизация","№№","60\nочки","сумма","место","Длина\nочки","сумма","место","Ядро\nочки","сумма","место","Высота\nочки","сумма","место","60м с/б\nочки","сумма","место","Шест\nочки","сумма","место","1000м\nочки",{"$nulls":3},"Сумма","Место","Разряд","Очки","Тренер"]
[1,{"$f":"VLOOKUP($E8,#REF!,2,FALSE)","v":{"$error":"#REF!"}},{"$f":"VLOOKUP($E8,#REF!,3,FALSE)","v":{"$error":"#REF!"}},{"$f":"VLOOKUP($E8,#REF!,5,FALSE)","v":{"$error":"#REF!"}},58,7.95,{"$f":"F9","v":574},{"$f":"RANK(G8,G$8:G$17)","v":3},6.15,{"$f":"G8+I9","v":1193},{"$f":"RANK(J8,J$8:J$17)","v":2},13.11,{"$f":"J8+L9","v":1867},{"$f":"RANK(M8,M$8:M$17)","v":1},1.81,{"$f":"M8+O9","v":2503},{"$f":"RANK(P8,P$8:P$17)","v":1},{"v":9.1,"d":"9.10"},{"$f":"P8+R9","v":3227},{"$f":"RANK(S8,S$8:S$17)","v":1},{"v":3.6,"d":"3.60"},{"$f":"S8+U9","v":3736},{"$f":"RANK(V8,V$8:V$17)","v":1},"2,57,8",{"$f":"MID(X8,1,1)","v":"2"},{"$f":"MID(X8,3,5)","v":"57,8"},{"$f":"Y8*60+Z8","v":"1900-06-25T19:12:00"},{"$f":"SUM(F9:X9)","v":4422},{"$f":"RANK(AB8,AB$18:AB$969)","v":{"$error":"#REF!"}},"1","лич",{"$f":"VLOOKUP($E8,#REF!,7,FALSE)","v":{"$error":"#REF!"}}]
[" ",null,null,{"$f":"VLOOKUP($E8,#REF!,6,FALSE)","v":{"$error":"#REF!"}},null,{"$f":"INT(58.015*(11.5-F8)^1.81)","v":574},null,null,{"$f":"INT(0.14354*(I8*100-220)^1.4)","v":619},null,null,{"$f":"INT(51.39*(L8-1.5)^1.05)","v":674},null,null,{"$f":"INT(0.8465*(O8*100-75)^1.42)","v":636},null,null,{"$f":"INT(20.5173*(15.5-R8)^1.92)","v":724},null,null,{"$f":"INT(0.2797*(U8*100-100)^1.35)","v":509},null,null,{"$f":"INT(0.08713*(305.5-AA8)^1.85)","v":686}]
[2,{"$f":"VLOOKUP($E10,#REF!,2,FALSE)","v":{"$error":"#REF!"}},{"$f":"VLOOKUP($E10,#REF!,3,FALSE)","v":{"$error":"#REF!"}},{"$f":"VLOOKUP($E10,#REF!,5,FALSE)","v":{"$error":"#REF!"}},41,8.17,{"$f":"F11","v":511},{"$f":"RANK(G10,G$8:G$17)","v":5},6.23,{"$f":"G10+I11","v":1148},{"$f":"RANK(J10,J$8:J$17)","v":4},11.36,{"$f":"J10+L11","v":1716},{"$f":"RANK(M10,M$8:M$17)","v":4},1.69,{"$f":"M10+O11","v":2252},{"$f":"RANK(P10,P$8:P$17)","v":4},8.75,{"$f":"P10+R11","v":3054},{"$f":"RANK(S10,S$8:S$17)","v":3},{"v":2.6,"d":"2.60"},{"$f":"S10+U11","v":3318},{"$f":"RANK(V10,V$8:V$17)","v":3},"2,48,1",{"$f":"MID(X10,1,1)","v":"2"},{"$f":"MID(X10,3,5)","v":"48,1"},{"$f":"Y10*60+Z10","v":"1900-06-16T02:24:00"},{"$f":"SUM(F11:X11)","v":4104},{"$f":"RANK(AB10,AB$18:AB$969)","v":{"$error":"#REF!"}},"1","лич",{"$f":"VLOOKUP($E10,#REF!,7,FALSE)","v":{"$error":"#REF!"}}]
[{"$nulls":3},{"$f":"VLOOKUP($E10,#REF!,6,FALSE)","v":{"$error":"#REF!"}},null,{"$f":"INT(58.015*(11.5-F10)^1.81)","v":511},null,null,{"$f":"INT(0.14354*(I10*100-220)^1.4)","v":637},null,null,{"$f":"INT(51.39*(L10-1.5)^1.05)","v":568},null,null,{"$f":"INT(0.8465*(O10*100-75)^1.42)","v":536},null,null,{"$f":"INT(20.5173*(15.5-R10)^1.92)","v":802},null,null,{"$f":"INT(0.2797*(U10*100-100)^1.35)","v":264},null,null,{"$f":"INT(0.08713*(305.5-AA10)^1.85)","v":786}]
[3,{"$f":"VLOOKUP($E12,#REF!,2,FALSE)","v":{"$error":"#REF!"}},{"$f":"VLOOKUP($E12,#REF!,3,FALSE)","v":{"$error":"#REF!"}},{"$f":"VLOOKUP($E12,#REF!,5,FALSE)","v":{"$error":"#REF!"}},48,8.01,{"$f":"F13","v":557},{"$f":"RANK(G12,G$8:G$17)","v":4},5.79,{"$f":"G12+I13","v":1099},{"$f":"RANK(J12,J$8:J$17)","v":5},10.33,{"$f":"J12+L13","v":1604},{"$f":"RANK(M12,M$8:M$17)","v":5},1.69,{"$f":"M12+O13","v":2140},{"$f":"RANK(P12,P$8:P$17)","v":5},9.15,{"$f":"P12+R13","v":2853},{"$f":"RANK(S12,S$8:S$17)","v":5},{"v":3.6,"d":"3.60"},{"$f":"S12+U13","v":3362},{"$f":"RANK(V12,V$8:V$17)","v":2},"2,47,4",{"$f":"MID(X12,1,1)","v":"2"},{"$f":"MID(X12,3,5)","v":"47,4"},{"$f":"Y12*60+Z12","v":"1900-06-15T09:36:00"},{"$f":"SUM(F13:X13)","v":4155},{"$f":"RANK(AB12,AB$18:AB$969)","v":{"$error":"#REF!"}},"1","20+5",{"$f":"VLOOKUP($E12,#REF!,7,FALSE)","v":{"$error":"#REF!"}}]
[{"$nulls":3},{"$f":"VLOOKUP($E12,#REF!,6,FALSE)","v":{"$error":"#REF!"}},null,{"$f":"INT(58.015*(11.5-F12)^1.81)","v":557},null,null,{"$f":"INT(0.14354*(I12*100-220)^1.4)","v":542},null,null,{"$f":"INT(51.39*(L12-1.5)^1.05)","v":505},null,null,{"$f":"INT(0.8465*(O12*100-75)^1.42)","v":536},null,null,{"$f":"INT(20.5173*(15.5-R12)^1.92)","v":713},null,null,{"$f":"INT(0.2797*(U12*100-100)^1.35)","v":509},null,null,{"$f":"INT(0.08713*(305.5-AA12)^1.85)","v":793}]
["ВК",{"$f":"VLOOKUP($E14,#REF!,2,FALSE)","v":{"$error":"#REF!"}},{"$f":"VLOOKUP($E14,#REF!,3,FALSE)","v":{"$error":"#REF!"}},{"$f":"VLOOKUP($E14,#REF!,5,FALSE)","v":{"$error":"#REF!"}},49,7.69,{"$f":"F15","v":653},{"$f":"RANK(G14,G$8:G$17)","v":2},5.59,{"$f":"G14+I15","v":1153},{"$f":"RANK(J14,J$8:J$17)","v":3},12.04,{"$f":"J14+L15","v":1762},{"$f":"RANK(M14,M$8:M$17)","v":2},1.66,{"$f":"M14+O15","v":2274},{"$f":"RANK(P14,P$8:P$17)","v":3},8.59,{"$f":"P14+R15","v":3113},{"$f":"RANK(S14,S$8:S$17)","v":2},{"v":2.3,"d":"2.30"},{"$f":"S14+U15","v":3312},{"$f":"RANK(V14,V$8:V$17)","v":5},"3,08,2",{"$f":"MID(X14,1,1)","v":"3"},{"$f":"MID(X14,3,5)","v":"08,2"},{"$f":"Y14*60+Z14","v":"1900-07-06T04:48:00"},{"$f":"SUM(F15:X15)","v":3898},{"$f":"RANK(AB14,AB$18:AB$969)","v":{"$error":"#REF!"}},"2","лич",{"$f":"VLOOKUP($E14,#REF!,7,FALSE)","v":{"$error":"#REF!"}}]
[{"$nulls":3},{"$f":"VLOOKUP($E14,#REF!,6,FALSE)","v":{"$error":"#REF!"}},null,{"$f":"INT(58.015*(11.5-F14)^1.81)","v":653},null,null,{"$f":"INT(0.14354*(I14*100-220)^1.4)","v":500},null,null,{"$f":"INT(51.39*(L14-1.5)^1.05)","v":609},null,null,{"$f":"INT(0.8465*(O14*100-75)^1.42)","v":512},null,null,{"$f":"INT(20.5173*(15.5-R14)^1.92)","v":839},null,null,{"$f":"INT(0.2797*(U14*100-100)^1.35)","v":199},null,null,{"$f":"INT(0.08713*(305.5-AA14)^1.85)","v":586}]
{"$rows_left_out":56}
{"sheet":"Семиборье (1998-1999)","index":1,"n_rows":18,"n_cols":32,"rows_kept":18,"merged":[[0,0,0,31],[1,0,1,31],[3,0,3,29],[5,20,5,31],[7,31,8,31],[9,31,10,31],[14,31,15,31],[16,31,17,31]]}
["ЦЕНТР СПОРТИВНОЙ ПОДГОТОВКИ МДМС РЕСПУБЛИКИ ТАТАРСТАН"]
[" "]
[]
["ЗИМНИЙ ЛИЧНЫЙ ЧЕМПИОНАТ И ПЕРВЕНСТВО РЕСПУБЛИКИ ТАТАРСТАН СРЕДИ ЮНИОРОВ ДО 20 ЛЕТ ПО ЛЕГКОЙ АТЛЕТИКЕ В ПОМЕЩЕНИИ"]
[{"$nulls":31},"23 ДЕКАБРЯ 2016г."]
[null,"МУЖЧИНЫ 1997г.р. и старше",null," ",{"$nulls":16},"г. Казань, Футбольно-легкоатлетический манеж"]
["Место","Фамилия Имя","Д.р.","Команда,\nорганизация","№№","60\nочки","сумма","место","Длина\nочки","сумма","место","Ядро\nочки","сумма","место","Высота\nочки","сумма","место","60м с/б\nочки","сумма","место","Шест\nочки","сумма","место","1000м\nочки",{"$nulls":3},"Сумма","Место","Разряд","Очки","Тренер"]
[1,"ШАРИФУЛЛИН ИЛЬНАЗ",1994,"КАЗАНЬ",134,7.54,700,{"$error":"#N/A"},6.28,1348,{"$error":"#N/A"},9.22,1787,{"$error":"#N/A"},1.73,2356,{"$error":"#N/A"},9.62,2971,{"$error":"#N/A"},{"v":4.2,"d":"4.20"},3644,{"$error":"#N/A"},"2,50,9","2","50,9","1900-06-18T21:36:00",4400,{"$error":"#N/A"},1,"лич","ФАЙЗУЛЛИНА ГП"]
[" ",null,null,"СДЮСШОР ЛА",null,700,null,null,648,null,null,439,null,null,569,null,null,615,null,null,673,null,null,756]
[2,"БРАЙНИН СЕРГЕЙ",1997,"КАЗАНЬ",2917,7.55,697,1,5.18,1114,1,10.05,1603,1,1.91,2326,1,9.34,2999,1,{"v":3.6,"d":"3.60"},3508,1,"3,08,2","3","08,2","1900-07-06T04:48:00",4094,1,1,"лич","ВОСТРИКОВА ИА, ЗАХАРЧУК ДГ"]
[" ",null,null,"СДЮСШОР ЛА",null,697,null,null,417,null,null,489,null,null,723,null,null,673,null,null,509,null,null,586]
[]
[null,"ЮНИОРЫ 1998-1999г.р.",null," "]
["Место","Фамилия Имя","Д.р.","Команда,\nорганизация","№№","60\nочки","сумма","место","Длина\nочки","сумма","место","Ядро\nочки","сумма","место","Высота\nочки","сумма","место","60м с/б\nочки","сумма","место","Шест\nочки","сумма","место","1000м\nочки",{"$nulls":3},"Сумма","Место","Разряд","Очки","Тренер"]
[1,"ЗАРИПОВ РАИЛЬ",1999,"НИЖНЕКАМСК",162,7.62,675,1,6.08,1279,1,9.41,1729,1,1.82,2373,1,9.04,3110,1,{"v":3.2,"d":"3.20"},3516,1,"3,00,8","3","00,8","1900-06-28T19:12:00",4172,1,"1","22+5","НОСОВА МЕ"]
{"$rows_left_out":4}
{"sheet":"Семиборье (1998-1999) РТ","index":2,"n_rows":32,"n_cols":32,"rows_kept":32,"hidden":true,"merged":[[0,0,0,31],[1,0,1,31],[3,0,3,29],[5,20,5,31],[7,31,8,31],[9,31,10,31],[11,31,12,31],[13,31,14,31],[18,31,19,31],[20,31,21,31],[22,31,23,31],[24,31,25,31],[26,31,27,31],[28,31,29,31],[30,31,31,31]]}
["РЕСПУБЛИКАНСКИЙ ЦЕНТР ФИЗИЧЕСКОЙ КУЛЬТУРЫ И ЮНОШЕСКОГО СПОРТА РТ"]
[{"$f":"#REF!","v":{"$error":"#REF!"}}]
[]
["ПЕРВЕНСТВО РЕСПУБЛИКИ ТАТАРСТАН ПО МНОГОБОРЬЯМ"]
[{"$nulls":31},{"$f":"#REF!","v":{"$error":"#REF!"}}]
[null,{"$f":"#REF!","v":{"$error":"#REF!"}},null," ",{"$nulls":16},{"$f":"#REF!","v":{"$error":"#REF!"}}]
["Место","Фамилия Имя","Д.р.","Команда,\nорганизация","№№","60\nочки","сумма","место","Длина\nочки","сумма","место","Ядро\nочки","сумма","место","Высота\nочки","сумма","место","60м с/б\nочки","сумма","место","Шест\nочки","сумма","место","1000м\nочки",{"$nulls":3},"Сумма","Место","Разряд","Очки","Тренер"]
[1,{"$f":"VLOOKUP($E8,#REF!,2,FALSE)","v":{"$error":"#REF!"}},{"$f":"VLOOKUP($E8,#REF!,3,FALSE)","v":{"$error":"#REF!"}},{"$f":"VLOOKUP($E8,#REF!,5,FALSE)","v":{"$error":"#REF!"}},59,7.62,{"$f":"F9","v":675},{"$f":"RANK(G8,G$8:G$15)","v":1},6.08,{"$f":"G8+I9","v":1279},{"$f":"RANK(J8,J$8:J$15)","v":2},10.63,{"$f":"J8+L9","v":1803},{"$f":"RANK(M8,M$8:M$15)","v":2},1.85,{"$f":"M8+O9","v":2473},{"$f":"RANK(P8,P$8:P$15)","v":1},8.89,{"$f":"P8+R9","v":3243},{"$f":"RANK(S8,S$8:S$15)","v":1},{"v":3.9,"d":"3.90"},{"$f":"S8+U9","v":3833},{"$f":"RANK(V8,V$8:V$15)","v":1},"2,54,83",{"$f":"MID(X8,1,1)","v":"2"},{"$f":"MID(X8,3,5)","v":"54,83"},{"$f":"Y8*60+Z8","v":"1900-06-22T19:55:12"},{"$f":"SUM(F9:X9)","v":4549},{"$f":"RANK(AB8,AB$8:AB$15)","v":1},"1","лич",{"$f":"VLOOKUP($E8,#REF!,7,FALSE)","v":{"$error":"#REF!"}}]
[" ",null,null,{"$f":"VLOOKUP($E8,#REF!,6,FALSE)","v":{"$error":"#REF!"}},null,{"$f":"INT(58.015*(11.5-F8)^1.81)","v":675},null,null,{"$f":"INT(0.14354*(I8*100-220)^1.4)","v":604},null,null,{"$f":"INT(51.39*(L8-1.5)^1.05)","v":524},null,null,{"$f":"INT(0.8465*(O8*100-75)^1.42)","v":670},null,null,{"$f":"INT(20.5173*(15.5-R8)^1.92)","v":770},null,null,{"$f":"INT(0.2797*(U8*100-100)^1.35)","v":590},null,null,{"$f":"INT(0.08713*(305.5-AA8)^1.85)","v":716}]
[2,{"$f":"VLOOKUP($E10,#REF!,2,FALSE)","v":{"$error":"#REF!"}},{"$f":"VLOOKUP($E10,#REF!,3,FALSE)","v":{"$error":"#REF!"}},{"$f":"VLOOKUP($E10,#REF!,5,FALSE)","v":{"$error":"#REF!"}},42,7.71,{"$f":"F11","v":646},{"$f":"RANK(G10,G$8:G$15)","v":3},6.22,{"$f":"G10+I11","v":1281},{"$f":"RANK(J10,J$8:J$15)","v":1},{"v":9.9,"d":"9.90"},{"$f":"J10+L11","v":1761},{"$f":"RANK(M10,M$8:M$15)","v":3},1.76,{"$f":"M10+O11","v":2354},{"$f":"RANK(P10,P$8:P$15)","v":2},9.33,{"$f":"P10+R11","v":3029},{"$f":"RANK(S10,S$8:S$15)","v":2},{"v":3.1,"d":"3.10"},{"$f":"S10+U11","v":3410},{"$f":"RANK(V10,V$8:V$15)","v":2},"3,09,95",{"$f":"MID(X10,1,1)","v":"3"},{"$f":"MID(X10,3,5)","v":"09,95"},{"$f":"Y10*60+Z10","v":"1900-07-07T22:48:00"},{"$f":"SUM(F11:X11)","v":3980},{"$f":"RANK(AB10,AB$8:AB$15)","v":2},"2","лич",{"$f":"VLOOKUP($E10,#REF!,7,FALSE)","v":{"$error":"#REF!"}}]
[" ",null,null,{"$f":"VLOOKUP($E10,#REF!,6,FALSE)","v":{"$error":"#REF!"}},null,{"$f":"INT(58.015*(11.5-F10)^1.81)","v":646},null,null,{"$f":"INT(0.14354*(I10*100-220)^1.4)","v":635},null,null,{"$f":"INT(51.39*(L10-1.5)^1.05)","v":480},null,null,{"$f":"INT(0.8465*(O10*100-75)^1.42)","v":593},null,null,{"$f":"INT(20.5173*(15.5-R10)^1.92)","v":675},null,null,{"$f":"INT(0.2797*(U10*100-100)^1.35)","v":381},null,null,{"$f":"INT(0.08713*(305.5-AA10)^1.85)","v":570}]
[3,{"$f":"VLOOKUP($E12,#REF!,2,FALSE)","v":{"$error":"#REF!"}},{"$f":"VLOOKUP($E12,#REF!,3,FALSE)","v":{"$error":"#REF!"}},{"$f":"VLOOKUP($E12,#REF!,5,FALSE)","v":{"$error":"#REF!"}},50,7.88,{"$f":"F13","v":595},{"$f":"RANK(G12,G$8:G$15)","v":4},5.46,{"$f":"G12+I13","v":1068},{"$f":"RANK(J12,J$8:J$15)","v":4},9.58,{"$f":"J12+L13","v":1528},{"$f":"RANK(M12,M$8:M$15)","v":4},1.61,{"$f":"M12+O13","v":2000},{"$f":"RANK(P12,P$8:P$15)","v":4},{"v":9.6,"d":"9.60"},{"$f":"P12+R13","v":2619},{"$f":"RANK(S12,S$8:S$15)","v":3},{"v":3.6,"d":"3.60"},{"$f":"S12+U13","v":3128},{"$f":"RANK(V12,V$8:V$15)","v":3},"3,10,44",{"$f":"MID(X12,1,1)","v":"3"},{"$f":"MID(X12,3,5)","v":"10,44"},{"$f":"Y12*60+Z12","v":"1900-07-08T10:33:36"},{"$f":"SUM(F13:X13)","v":3694},{"$f":"RANK(AB12,AB$8:AB$15)","v":3},2,"лич",{"$f":"VLOOKUP($E12,#REF!,7,FALSE)","v":{"$error":"#REF!"}}]
[" ",null,null,{"$f":"VLOOKUP($E12,#REF!,6,FALSE)","v":{"$error":"#REF!"}},null,{"$f":"INT(58.015*(11.5-F12)^1.81)","v":595},null,null,{"$f":"INT(0.14354*(I12*100-220)^1.4)","v":473},null,null,{"$f":"INT(51.39*(L12-1.5)^1.05)","v":460},null,null,{"$f":"INT(0.8465*(O12*100-75)^1.42)","v":472},null,null,{"$f":"INT(20.5173*(15.5-R12)^1.92)","v":619},null,null,{"$f":"INT(0.2797*(U12*100-100)^1.35)","v":509},null,null,{"$f":"INT(0.08713*(305.5-AA12)^1.85)","v":566}]
[4,{"$f":"VLOOKUP($E14,#REF!,2,FALSE)","v":{"$error":"#REF!"}},{"$f":"VLOOKUP($E14,#REF!,3,FALSE)","v":{"$error":"#REF!"}},{"$f":"VLOOKUP($E14,#REF!,5,FALSE)","v":{"$error":"#REF!"}},43,{"v":7.7,"d":"7.70"},{"$f":"F15","v":650},{"$f":"RANK(G14,G$8:G$15)","v":2},{"v":5.6,"d":"5.60"},{"$f":"G14+I15","v":1152},{"$f":"RANK(J14,J$8:J$15)","v":3},13.75,{"$f":"J14+L15","v":1865},{"$f":"RANK(M14,M$8:M$15)","v":1},1.58,{"$f":"M14+O15","v":2314},{"$f":"RANK(P14,P$8:P$15)","v":3},"сошел",{"$f":"P14+R15","v":2314},{"$f":"RANK(S14,S$8:S$15)","v":4},{"v":0,"d":"0.00"},{"$f":"S14+U15","v":2314},{"$f":"RANK(V14,V$8:V$15)","v":4},"сошел",{"$f":"MID(X14,1,1)","v":"с"},{"$f":"MID(X14,3,5)","v":"шел"},{"$f":"Y14*60+Z14","v":{"$error":"#VALUE!"}},{"$f":"SUM(F15:X15)","v":2314},{"$f":"RANK(AB14,AB$8:AB$15)","v":4},"2Ю","лич",{"$f":"VLOOKUP($E14,#REF!,7,FALSE)","v":{"$error":"#REF!"}}]
[" ",null,null,{"$f":"VLOOKUP($E14,#REF!,6,FALSE)","v":{"$error":"#REF!"}},null,{"$f":"INT(58.015*(11.5-F14)^1.81)","v":650},null,null,{"$f":"INT(0.14354*(I14*100-220)^1.4)","v":502},null,null,{"$f":"INT(51.39*(L14-1.5)^1.05)","v":713},null,null,{"$f":"INT(0.8465*(O14*100-75)^1.42)","v":449},null,null,0,null,null,0,null,null,0]
{"$rows_left_out":18}
{"sheet":"Семиборье (1995-1997)","index":3,"n_rows":21,"n_cols":32,"rows_kept":21,"hidden":true,"merged":[[0,0,0,31],[1,0,1,31],[3,0,3,29],[7,31,8,31],[9,31,10,31],[11,31,12,31],[13,31,14,31],[15,31,16,31],[17,31,18,31],[19,31,20,31]]}
[{"$f":"#REF!","v":{"$error":"#REF!"}}]
[{"$f":"#REF!","v":{"$error":"#REF!"}}]
[]
[{"$f":"#REF!","v":{"$error":"#REF!"}}]
[]
[null,{"$f":"#REF!","v":{"$error":"#REF!"}},null," ",{"$nulls":25},{"$f":"#REF!","v":{"$error":"#REF!"}}]
["Место","Фамилия Имя","Д.р.","Команда,\nорганизация","№№","60\nочки","сумма","место","Длина\nочки","сумма","место","Ядро\nочки","сумма","место","Высота\nочки","сумма","место","60м с/б\nочки","сумма","место","Шест\nочки","сумма","место","1000м\nочки",{"$nulls":3},"Сумма","Место","Разряд","Очки","Тренер"]
[1,{"$f":"VLOOKUP($E8,#REF!,2,FALSE)","v":{"$error":"#REF!"}},{"$f":"VLOOKUP($E8,#REF!,3,FALSE)","v":{"$error":"#REF!"}},{"$f":"VLOOKUP($E8,#REF!,5,FALSE)","v":{"$error":"#REF!"}},2,8.11,{"$f":"F9","v":528},{"$f":"RANK(G8,G$8:G$19)","v":6}," ",{"$f":"G8+I9","v":{"$error":"#VALUE!"}},{"$f":"RANK(J8,J$8:J$10)","v":{"$error":"#VALUE!"}}," ",{"$f":"J8+L9","v":{"$error":"#VALUE!"}},{"$f":"RANK(M8,M$8:M$10)","v":{"$error":"#VALUE!"}}," ",{"$f":"M8+O9","v":{"$error":"#VALUE!"}},{"$f":"RANK(P8,P$8:P$10)","v":{"$error":"#VALUE!"}}," ",{"$f":"P8+R9","v":{"$error":"#VALUE!"}},{"$f":"RANK(S8,S$8:S$10)","v":{"$error":"#VALUE!"}}," ",{"$f":"S8+U9","v":{"$error":"#VALUE!"}},{"$f":"RANK(V8,V$8:V$10)","v":{"$error":"#VALUE!"}}," ",{"$f":"MID(X8,1,1)","v":" "},{"$f":"MID(X8,3,5)","v":""},{"$f":"Y8*60+Z8","v":{"$error":"#VALUE!"}},{"$f":"SUM(F9:X9)","v":{"$error":"#VALUE!"}},{"$f":"RANK(AB8,AB$8:AB$923)","v":{"$error":"#VALUE!"}},null,"25+15",{"$f":"VLOOKUP($E8,#REF!,7,FALSE)","v":{"$error":"#REF!"}}]
[{"$nulls":3},{"$f":"VLOOKUP($E8,#REF!,6,FALSE)","v":{"$error":"#REF!"}},null,{"$f":"INT(58.015*(11.5-F8)^1.81)","v":528},null,null,{"$f":"INT(0.14354*(I8*100-220)^1.4)","v":{"$error":"#VALUE!"}},null,null,{"$f":"INT(51.39*(L8-1.5)^1.05)","v":{"$error":"#VALUE!"}},null,null,{"$f":"INT(0.8465*(O8*100-75)^1.42)","v":{"$error":"#VALUE!"}},null,null,{"$f":"INT(20.5173*(15.5-R8)^1.92)","v":{"$error":"#VALUE!"}},null,null,{"$f":"INT(0.2797*(U8*100-100)^1.35)","v":{"$error":"#VALUE!"}},null,null,{"$f":"INT(0.08713*(305.5-AA8)^1.85)","v":{"$error":"#VALUE!"}}]
[2,{"$f":"VLOOKUP($E10,#REF!,2,FALSE)","v":{"$error":"#REF!"}},{"$f":"VLOOKUP($E10,#REF!,3,FALSE)","v":{"$error":"#REF!"}},{"$f":"VLOOKUP($E10,#REF!,5,FALSE)","v":{"$error":"#REF!"}},40,7.66,{"$f":"F11","v":662},{"$f":"RANK(G10,G$8:G$19)","v":3}," ",{"$f":"G10+I11","v":{"$error":"#VALUE!"}},{"$f":"RANK(J10,J$8:J$10)","v":{"$error":"#VALUE!"}}," ",{"$f":"J10+L11","v":{"$error":"#VALUE!"}},{"$f":"RANK(M10,M$8:M$10)","v":{"$error":"#VALUE!"}}," ",{"$f":"M10+O11","v":{"$error":"#VALUE!"}},{"$f":"RANK(P10,P$8:P$10)","v":{"$error":"#VALUE!"}}," ",{"$f":"P10+R11","v":{"$error":"#VALUE!"}},{"$f":"RANK(S10,S$8:S$10)","v":{"$error":"#VALUE!"}}," ",{"$f":"S10+U11","v":{"$error":"#VALUE!"}},{"$f":"RANK(V10,V$8:V$10)","v":{"$error":"#VALUE!"}}," ",{"$f":"MID(X10,1,1)","v":" "},{"$f":"MID(X10,3,5)","v":""},{"$f":"Y10*60+Z10","v":{"$error":"#VALUE!"}},{"$f":"SUM(F11:X11)","v":{"$error":"#VALUE!"}},{"$f":"RANK(AB10,AB$8:AB$923)","v":{"$error":"#VALUE!"}},null,"лич",{"$f":"VLOOKUP($E10,#REF!,7,FALSE)","v":{"$error":"#REF!"}}]
[{"$nulls":3},{"$f":"VLOOKUP($E10,#REF!,6,FALSE)","v":{"$error":"#REF!"}},null,{"$f":"INT(58.015*(11.5-F10)^1.81)","v":662},null,null,{"$f":"INT(0.14354*(I10*100-220)^1.4)","v":{"$error":"#VALUE!"}},null,null,{"$f":"INT(51.39*(L10-1.5)^1.05)","v":{"$error":"#VALUE!"}},null,null,{"$f":"INT(0.8465*(O10*100-75)^1.42)","v":{"$error":"#VALUE!"}},null,null,{"$f":"INT(20.5173*(15.5-R10)^1.92)","v":{"$error":"#VALUE!"}},null,null,{"$error":"#VALUE!"},null,null,{"$f":"INT(0.08713*(305.5-AA10)^1.85)","v":{"$error":"#VALUE!"}}]
[3,{"$f":"VLOOKUP($E12,#REF!,2,FALSE)","v":{"$error":"#REF!"}},{"$f":"VLOOKUP($E12,#REF!,3,FALSE)","v":{"$error":"#REF!"}},{"$f":"VLOOKUP($E12,#REF!,5,FALSE)","v":{"$error":"#REF!"}},51,7.71,{"$f":"F13","v":646},{"$f":"RANK(G12,G$8:G$19)","v":4}," ",{"$f":"G12+I13","v":{"$error":"#VALUE!"}}," "," ",{"$f":"J12+L13","v":{"$error":"#VALUE!"}}," "," ",{"$f":"M12+O13","v":{"$error":"#VALUE!"}}," "," ",{"$f":"P12+R13","v":{"$error":"#VALUE!"}}," "," ",{"$f":"S12+U13","v":{"$error":"#VALUE!"}},null," ",{"$f":"MID(X12,1,1)","v":" "},{"$f":"MID(X12,3,5)","v":""},{"$f":"Y12*60+Z12","v":{"$error":"#VALUE!"}},{"$f":"SUM(F13:X13)","v":{"$error":"#VALUE!"}},{"$f":"RANK(AB12,AB$8:AB$923)","v":{"$error":"#VALUE!"}},null,"22+5",{"$f":"VLOOKUP($E12,#REF!,7,FALSE)","v":{"$error":"#REF!"}}]
[{"$nulls":3},{"$f":"VLOOKUP($E12,#REF!,6,FALSE)","v":{"$error":"#REF!"}},null,{"$f":"INT(58.015*(11.5-F12)^1.81)","v":646},null,null,{"$f":"INT(0.14354*(I12*100-220)^1.4)","v":{"$error":"#VALUE!"}},null,null,{"$f":"INT(51.39*(L12-1.5)^1.05)","v":{"$error":"#VALUE!"}},null,null,{"$f":"INT(0.8465*(O12*100-75)^1.42)","v":{"$error":"#VALUE!"}},null,null,{"$f":"INT(20.5173*(15.5-R12)^1.92)","v":{"$error":"#VALUE!"}},null,null,{"$f":"INT(0.2797*(U12*100-100)^1.35)","v":{"$error":"#VALUE!"}},null,null,{"$f":"INT(0.08713*(305.5-AA12)^1.85)","v":{"$error":"#VALUE!"}}]
[4,{"$f":"VLOOKUP($E14,#REF!,2,FALSE)","v":{"$error":"#REF!"}},{"$f":"VLOOKUP($E14,#REF!,3,FALSE)","v":{"$error":"#REF!"}},{"$f":"VLOOKUP($E14,#REF!,5,FALSE)","v":{"$error":"#REF!"}},52,7.27,{"$f":"F15","v":789},{"$f":"RANK(G14,G$8:G$19)","v":1}," ",{"$f":"G14+I15","v":{"$error":"#VALUE!"}}," "," ",{"$f":"J14+L15","v":{"$error":"#VALUE!"}}," "," ",{"$f":"M14+O15","v":{"$error":"#VALUE!"}}," "," ",{"$f":"P14+R15","v":{"$error":"#VALUE!"}}," "," ",{"$f":"S14+U15","v":{"$error":"#VALUE!"}},null," ",{"$f":"MID(X14,1,1)","v":" "},{"$f":"MID(X14,3,5)","v":""},{"$f":"Y14*60+Z14","v":{"$error":"#VALUE!"}},{"$f":"SUM(F15:X15)","v":{"$error":"#VALUE!"}},{"$f":"RANK(AB14,AB$8:AB$923)","v":{"$error":"#VALUE!"}},null,"22+5",{"$f":"VLOOKUP($E14,#REF!,7,FALSE)","v":{"$error":"#REF!"}}]
[{"$nulls":3},{"$f":"VLOOKUP($E14,#REF!,6,FALSE)","v":{"$error":"#REF!"}},null,789,null,null,{"$error":"#VALUE!"},null,null,{"$error":"#VALUE!"},null,null,{"$error":"#VALUE!"},null,null,{"$error":"#VALUE!"},null,null,{"$error":"#VALUE!"},null,null,{"$f":"INT(0.08713*(305.5-AA14)^1.85)","v":{"$error":"#VALUE!"}}]
{"$rows_left_out":6}